Target
Cystic fibrosis transmembrane conductance regulator
Ligand
BDBM200254
Substrate
EC50
>45000±n/a nM
Citation
 PubChem, PC Phenotypic Assay to Identify Small Molecules that Upregulate Production of hCFTR in HeLa Cells PubChem Bioassay (2016)[AID] 
Target
Name:
Cystic fibrosis transmembrane conductance regulator
Synonyms:
ABCC7 CFTR Channel conductance-controlling ATPase | cAMP-dependent chloride channel
Type:
Enzyme Catalytic Domain
Mol. Mass.:
168171.30
Organism:
Homo sapiens (Human)
Description:
gi_90421313
Residue:
1480
  
Inhibitor
Name:
BDBM200254
Synonyms:
AB00998676-01 | cid_42923401
Type:
Small organic molecule
Emp. Form.:
C18H17ClN2O5S2
Mol. Mass.:
440.921
SMILES:
Clc1c(COC(=O)C2=NN(C3CCS(=O)(=O)C3)C(=O)CC2)sc2ccccc12
: