Target
6-phosphofructo-2-kinase/fructose-2,6-bisphosphatase 4
Ligand
BDBM200939
Substrate
Meas. Tech.
Kinase Assay (Method B)
IC50
130±n/a nM
Citation
 Bystrom, SHedgecock, CHoman, ELundback, TMartinsson, JSari, MFarnegardh, KJonsson, M Sulfonamide compounds US Patent  US9233946 Publication Date 1/12/2016 
Target
Name:
6-phosphofructo-2-kinase/fructose-2,6-bisphosphatase 4
Synonyms:
6-phosphofructo-2-kinase/fructose-2,6-bisphosphatase 4 (PFKFB4) PFKFB4
Type:
Enzyme
Mol. Mass.:
54039.68
Organism:
Homo sapiens (Human)
Description:
Q16877
Residue:
469
  
Inhibitor
Name:
BDBM200939
Synonyms:
US9233946, 38
Type:
Small organic molecule
Emp. Form.:
C16H12ClNO4S2
Mol. Mass.:
381.854
SMILES:
Cc1c(sc2ccc(Cl)cc12)S(=O)(=O)Nc1cccc(c1)C(O)=O
: