Target
Alpha-1,6-mannosyl-glycoprotein 2-beta-N-acetylglucosaminyltransferase
Ligand
BDBM201510
Substrate
Meas. Tech.
MGAT LCMS Assay
pH
7.4±n/a
IC50
2±n/a nM
Comments
extracted
Citation
 Turdi, HHangeland, JJLawrence, RMCheng, DAhmad, SMeng, WBrigance, RPDevasthale, PZhao, G Aryl dihydropyridinones and piperidinone MGAT2 inhibitors US Patent  US9187424 Publication Date 11/17/2015 
Target
Name:
Alpha-1,6-mannosyl-glycoprotein 2-beta-N-acetylglucosaminyltransferase
Synonyms:
2.4.1.143 GNT-II MGAT2 Mannoside acetylglucosaminyltransferase 2 Monoacylglycerol acyltransferase type 2 (h-MGAT2) h-MGAT2 (human monoacylglycerol acyltransferase type 2)
Type:
Mol. Mass.:
51567.80
Organism:
Homo sapiens (Human)
Description:
Q10469
Residue:
447
  
Inhibitor
Name:
BDBM201510
Synonyms:
US9187424, 277
Type:
Small organic molecule
Emp. Form.:
C27H24F7N5O2
Mol. Mass.:
583.5006
SMILES:
Fc1cc(OCCCC(F)(F)F)ccc1C1(CC(=C(c2nn[nH]n2)C(=O)N1)c1ccc(CC2CC2)cc1)C(F)(F)F
: