Target
Sodium-dependent dopamine transporter
Ligand
BDBM202585
Substrate
Meas. Tech.
Radioligand Binding Assay
Ki
1.16±n/a nM
Citation
 Bhat, LAdiey, KBhat, SR Compositions, synthesis, and methods of using phenylcycloalkylmethylamine derivatives US Patent  US9238625 Publication Date 1/19/2016 
Target
Name:
Sodium-dependent dopamine transporter
Synonyms:
DA transporter DAT1 Dopamine transporter protein (DAT) SC6A3_HUMAN Sodium-dependent dopamine transporter Solute carrier family 6 member 3
Type:
Multi-pass membrane protein
Mol. Mass.:
68497.11
Organism:
Homo sapiens (Human)
Description:
Q01959
Residue:
620
  
Inhibitor
Name:
BDBM202585
Synonyms:
US10035761, Compound 8j | US9238625, 8j
Type:
Small organic molecule
Emp. Form.:
C21H33Cl2NO
Mol. Mass.:
386.399
SMILES:
CCOCCCCN[C@H](CC(C)C)C1(CCC1)c1ccc(Cl)c(Cl)c1
: