Target
Poly(ADP-ribose) glycohydrolase
Ligand
BDBM205479
Substrate
Meas. Tech.
PARG Biochemical Assay
pH
7.4±n/a
IC50
26± 3 nM
Comments
extracted
Citation
 James, DISmith, KMJordan, AMFairweather, EEGriffiths, LAHamilton, NSHitchin, JRHutton, CPJones, SKelly, PMcGonagle, AESmall, HStowell, AITucker, JWaddell, IDWaszkowycz, BOgilvie, DJ First-in-Class Chemical Probes against Poly(ADP-ribose) Glycohydrolase (PARG) Inhibit DNA Repair with Differential Pharmacology to Olaparib. ACS Chem Biol 11:3179-3190 (2016)  
Target
Name:
Poly(ADP-ribose) glycohydrolase
Synonyms:
PARG Poly(ADP-ribose) glycohydrolase | poly(ADP-ribose) glycohydrolase (PARG)
Type:
Protein
Mol. Mass.:
111107.13
Organism:
Homo sapiens (Human)
Description:
Q86W56
Residue:
976
  
Inhibitor
Name:
BDBM205479
Synonyms:
PDD00017273 (4) | US20230278998, Compound PDD00017273
Type:
Small organic molecule
Emp. Form.:
C23H26N6O4S2
Mol. Mass.:
514.62
SMILES:
Cc1cc(Cn2c3ccc(cc3c(=O)n(Cc3cnc(C)s3)c2=O)S(=O)(=O)NC2(C)CC2)n(C)n1
: