Target
Prostaglandin G/H synthase 2
Ligand
BDBM50035218
Substrate
Meas. Tech.
COX Enzyme Inhibition Assay (Table 1)
IC50
>2.5e+4±n/a nM
Citation
 Uddin, MJCrews, BCXu, SGhebreselasie, KDaniel, CKKingsley, PJBanerjee, SMarnett, LJ Antitumor Activity of Cytotoxic Cyclooxygenase-2 Inhibitors. ACS Chem Biol 11:3052-3060 (2016)  
Target
Name:
Prostaglandin G/H synthase 2
Synonyms:
Cox-2 Cyclooxygenase-2 Glucocorticoid-regulated inflammatory cyclooxygenase Macrophage activation-associated marker protein P71/73 PGH synthase 2 PGHS-2 Pghs-b Prostaglandin H2 synthase 2 Ptgs2 Tis10
Type:
Protein
Mol. Mass.:
69020.39
Organism:
Mus musculus (Mouse)
Description:
Q05769
Residue:
604
  
Inhibitor
Name:
BDBM50035218
Synonyms:
CHEMBL61 Podophyllinic acid lactone podophyllotoxin
Type:
Small organic molecule
Emp. Form.:
C22H22O8
Mol. Mass.:
414.4053
SMILES:
COc1cc(cc(OC)c1OC)[C@H]1[C@@H]2[C@H](COC2=O)[C@@H](O)c2cc3OCOc3cc12
: