Target
Tyrosine-protein kinase ABL1 [T315I]
Ligand
BDBM13530
Substrate
Abltide
Meas. Tech.
ABL1 (T315I) Kinase Activity Assay
Temperature
298.15±n/a K
IC50
>1000±0 nM
Comments
extracted
Citation
 Wang, YZhao, LZhang, DWu, FBi, SGao, YChen, HChen, HZhang, CNan, YLiu, Y Heteroaryl alkyne compound and use thereof US Patent  US9255107 Publication Date 2/9/2016 
Target
Name:
Tyrosine-protein kinase ABL1 [T315I]
Synonyms:
ABL ABL1 Abelson murine leukemia viral oncogene homolog 1 Proto-oncogene c-Abl Tyrosine-protein kinase ABL (T315I) c-ABL p150
Type:
Mol. Mass.:
122909.35
Organism:
Homo sapiens (Human)
Description:
P00519 (T315I)
Residue:
1130
  
Inhibitor
Name:
BDBM13530
Synonyms:
4-[(4-methylpiperazin-1-yl)methyl]-N-[4-methyl-3-[(4-pyridin-3-ylpyrimidin-2-yl)amino]phenyl]benzamide Gleevec Imatinib, 21 STI-571 US10906896, Cpd imatinib US11725005, Compound imatinib cid_5291 med.21724, Compound 6
Type:
Small organic molecule
Emp. Form.:
C29H31N7O
Mol. Mass.:
493.6027
SMILES:
CN1CCN(Cc2ccc(cc2)C(=O)Nc2ccc(C)c(Nc3nccc(n3)-c3cccnc3)c2)CC1
:
Substrate
Name:
Abltide
Synonyms:
Type:
Protein
Mol. Mass.:
1338.59
Organism:
Homo sapiens (Human)
Description:
Peptide substrate Abltide (EAIYAAPFAKKK), purchased from Millipore Corporation, USA.
Residue:
12
EAIYAAPFAKKK