Target
Acyl-protein thioesterase 1
Ligand
BDBM207991
Substrate
Meas. Tech.
Steady-State Kinetic Assays
pH
6.5±n/a
Ki
280±33 nM
Comments
extracted
Citation
 Won, SJDavda, DLabby, KJHwang, SYPricer, RMajmudar, JDArmacost, KARodriguez, LARodriguez, CLChong, FSTorossian, KAPalakurthi, JHur, ESMeagher, JLBrooks, CLStuckey, JAMartin, BR Molecular Mechanism for Isoform-Selective Inhibition of Acyl Protein Thioesterases 1 and 2 (APT1 and APT2). ACS Chem Biol 11:3374-3382 (2016)  
Target
Name:
Acyl-protein thioesterase 1
Synonyms:
APT-1 Acyl-protein thioesterase 1 (APT1 WT) LPL1 LYPLA1 Lysophospholipase 1 hAPT1
Type:
Protein
Mol. Mass.:
24670.33
Organism:
Homo sapiens (Human)
Description:
O75608
Residue:
230
  
Inhibitor
Name:
BDBM207991
Synonyms:
ML348
Type:
Small organic molecule
Emp. Form.:
C18H17ClF3N3O3
Mol. Mass.:
415.794
SMILES:
FC(F)(F)c1ccc(Cl)c(NC(=O)CN2CCN(CC2)C(=O)c2ccco2)c1
: