Target
Beta-secretase 1
Ligand
BDBM209917
Substrate
Meas. Tech.
Cellular Aβ-Lowering Assay
Temperature
310.15±n/a K
IC50
0.0002±n/a nM
Comments
extracted
Citation
 Hilpert, HWoltering, T 5-amino[1,4]thiazines as BACE 1 inhibitors US Patent  US9273042 Publication Date 3/1/2016 
Target
Name:
Beta-secretase 1
Synonyms:
ASP2 Aspartyl protease 2 BACE1 Beta-secretase (BACE) Beta-secretase 1 (BACE 1) Beta-secretase 1 (BACE1) Beta-site amyloid precursor protein cleaving enzyme 1 Memapsin-2 beta-Secretase (BACE-1) | beta-Secretase (BACE1)
Type:
Protein
Mol. Mass.:
55755.10
Organism:
Homo sapiens (Human)
Description:
P56817
Residue:
501
  
Inhibitor
Name:
BDBM209917
Synonyms:
US9273042, 6 | US9556135, 23
Type:
Small organic molecule
Emp. Form.:
C20H20FN5O3S
Mol. Mass.:
429.468
SMILES:
CC1(C)C(N)=N[C@@](C)(CS1(=O)=O)c1cc(NC(=O)c2ccc(cn2)C#N)ccc1F
: