Target
Ephrin type-A receptor 2 [596-900]
Ligand
BDBM50100615
Substrate
Meas. Tech.
Kinobeads Competition Assay
Kd
25±0.0 nM
Citation
 Heinzlmeir, SKudlinzki, DSreeramulu, SKlaeger, SGande, SLLinhard, VWilhelm, MQiao, HHelm, DRuprecht, BSaxena, KMédard, GSchwalbe, HKuster, B Chemical Proteomics and Structural Biology Define EPHA2 Inhibition by Clinical Kinase Drugs. ACS Chem Biol 11:3400-3411 (2016)  
Target
Name:
Ephrin type-A receptor 2 [596-900]
Synonyms:
ECK EPHA2_HUMAN | Ephrin type-A receptor 2 (EPHA2)
Type:
Protein
Mol. Mass.:
34367.96
Organism:
Homo sapiens (Human)
Description:
EPHA2 truncation (596-900 aa); 519U
Residue:
305
  
Inhibitor
Name:
BDBM50100615
Synonyms:
E-7050 Golvatinib
Type:
Small organic molecule
Emp. Form.:
C33H37F2N7O4
Mol. Mass.:
633.6882
SMILES:
CN1CCN(CC1)C1CCN(CC1)C(=O)Nc1cc(Oc2ccc(NC(=O)C3(CC3)C(=O)Nc3ccc(F)cc3)c(F)c2)ccn1
: