Target
Dihydrofolate reductase
Ligand
BDBM18069
Substrate
Meas. Tech.
DHFR Inhibition Assay
IC50
3.80e+5± 1.2e+4 nM
Citation
 Reeve, SMScocchera, EWG-Dayanadan, NKeshipeddy, SKrucinska, JHajian, BFerreira, JNailor, MAeschlimann, JWright, DLAnderson, AC MRSA Isolates from United States Hospitals Carry dfrG and dfrK Resistance Genes and Succumb to Propargyl-Linked Antifolates. Cell Chem Biol 23:1458-1467 (2016)  
Target
Name:
Dihydrofolate reductase
Synonyms:
Dihydrofolate reductase (DfrG)
Type:
Protein
Mol. Mass.:
19690.71
Organism:
Staphylococcus aureus
Description:
Q4H3Y3
Residue:
165
  
Inhibitor
Name:
BDBM18069
Synonyms:
5-[(3,4,5-trimethoxyphenyl)methyl]pyrimidine-2,4-diamine TMP Trimethoprim (TMP) | US10870625, Compound TMP
Type:
Small organic molecule
Emp. Form.:
C14H18N4O3
Mol. Mass.:
290.3177
SMILES:
COc1cc(Cc2cnc(N)nc2N)cc(OC)c1OC
: