Target
CD63 antigen
Ligand
BDBM212279
Substrate
Meas. Tech.
High Throughput Syk Biochemical Assay
pH
7±n/a
IC50
250±n/a nM
Comments
extracted
Citation
 Blomgren, PACurrie, KSKropf, JELee, SHLo, JRMitchell, SASchmitt, ACXiong, JXu, JZhao, ZSwaminathan, S Substituted imidazo[1,2-a]pyrazines as Syk inhibitors US Patent  US9290505 Publication Date 3/22/2016 
Target
Name:
CD63 antigen
Synonyms:
CD63 CD_antigen: CD63 Granulophysin Limp1 Lysosome integral membrane protein 1 Melanoma-associated antigen ME491 Ocular melanoma-associated antigen Tetraspanin-30 | Tspan-30
Type:
Mol. Mass.:
25640.41
Organism:
Homo sapiens (Human)
Description:
Residue:
238
  
Inhibitor
Name:
BDBM212279
Synonyms:
US11517570, Example Kn.-3: US9504684, 6-(5-amino-6-methylpyridin-3-yl)-N-(4-morpholinophenyl)imidazo[1,2-a]pyrazin-8-amine
Type:
Small organic molecule
Emp. Form.:
C22H23N7O
Mol. Mass.:
401.4643
SMILES:
Cc1ncc(cc1N)-c1cn2ccnc2c(Nc2ccc(cc2)N2CCOCC2)n1
: