Target
Bifunctional cytochrome P450/NADPH--P450 reductase [A82F,F87V]
Ligand
BDBM212439
Substrate
Meas. Tech.
Optical Titration Assay
pH
7±n/a
Kd
4± 3 nM
Comments
extracted
Citation
 Butler, CFPeet, CMason, AEVoice, MWLeys, DMunro, AW Key mutations alter the cytochrome P450 BM3 conformational landscape and remove inherent substrate bias. J Biol Chem 288:25387-99 (2013)  
Target
Name:
Bifunctional cytochrome P450/NADPH--P450 reductase [A82F,F87V]
Synonyms:
CPXB_PRIM2 cyp102 | cyp102A1
Type:
Protein
Mol. Mass.:
117780.88
Organism:
Bacillus megaterium
Description:
B. megaterium BM3 with A82F/F87V mutations
Residue:
1049
  
Inhibitor
Name:
BDBM212439
Synonyms:
N-palmitoylglycine (NPG)
Type:
Small organic molecule
Emp. Form.:
C18H35NO3
Mol. Mass.:
313.4754
SMILES:
CCCCCCCCCCCCCCCC(=O)NCC(O)=O
: