Target
Tyrosine-protein kinase ITK/TSK [357-620,Y512E]
Ligand
BDBM50062938
Substrate
Meas. Tech.
LanthaScreen Kinase Binding Assay
IC50
5.0±0 nM
Citation
 Harling, JDDeakin, AMCampos, SGrimley, RChaudry, LNye, CPolyakova, OBessant, CMBarton, NSomers, DBarrett, JGraves, RHHanns, LKerr, WJSolari, R Discovery of novel irreversible inhibitors of interleukin (IL)-2-inducible tyrosine kinase (Itk) by targeting cysteine 442 in the ATP pocket. J Biol Chem 288:28195-206 (2013)  
Target
Name:
Tyrosine-protein kinase ITK/TSK [357-620,Y512E]
Synonyms:
EMT ITK_HUMAN LYK
Type:
Enzyme
Mol. Mass.:
30027.99
Organism:
Homo sapiens (Human)
Description:
Human Itk truncation (357-620 aa) with Y512E mutation
Residue:
264
  
Inhibitor
Name:
BDBM50062938
Synonyms:
CHEMBL3397909 | N-[(3S)-1-Acryloyl-3-pyrrolidinyl]-N'-[1,3]thiazolo[5,4-b]pyridin-2-yl-4-({[(1S)-1,2,2-trimethylpropyl]amino}methyl)-2,6-pyridinediamine (12)
Type:
Small organic molecule
Emp. Form.:
C25H33N7OS
Mol. Mass.:
479.641
SMILES:
C[C@H](NCc1cc(N[C@H]2CCN(C2)C(=O)C=C)nc(Nc2nc3cccnc3s2)c1)C(C)(C)C
: