Target
Poly [ADP-ribose] polymerase 1
Ligand
BDBM213913
Substrate
Meas. Tech.
PARP Enzyme Inhibition Assay
pH
8±n/a
Ki
0.1±n/a nM
Comments
extracted
Citation
 Gandhi, VBGiranda, VLGong, JPenning, TDZhu, G Inhibitors of poly(ADP-ribose)polymerase US Patent  US9283222 Publication Date 3/15/2016 
Target
Name:
Poly [ADP-ribose] polymerase 1
Synonyms:
(ARTD1 or PARP1) 2.4.2.30 ADPRT ARTD1 Human diphtheria toxin-like ADP-ribosyltransferase (ARTD1 or PARP1) NT-PARP-1 PARP1 PPOL Poly [ADP-ribose] polymerase 1 (PARP) Poly [ADP-ribose] polymerase 1 (PARP1) Poly [ADP-ribose] polymerase 1, 28-kDa form Poly [ADP-ribose] polymerase 1, processed C-terminus Poly [ADP-ribose] polymerase-1 Poly(ADP-ribose) polymerase-1 (ARTD1/PARP1) Protein poly-ADP-ribosyltransferase PARP1 | Synonyms=ADPRT
Type:
Mol. Mass.:
113114.22
Organism:
Homo sapiens (Human)
Description:
P09874
Residue:
1014
  
Inhibitor
Name:
BDBM213913
Synonyms:
BDBM214427 | US9283222, Table 3, Compound 20
Type:
Small organic molecule
Emp. Form.:
C22H25FN4O3
Mol. Mass.:
412.4573
SMILES:
CC(=O)N1CCN(CC1)C(=O)c1cc(Cc2n[nH]c(=O)c3CCCCc23)ccc1F
: