Target
Solute carrier organic anion transporter family member
Ligand
BDBM50366524
Substrate
Meas. Tech.
Oatp1d1 Transport Assay
Ki
1.01e+3±n/a nM
Citation
 Popovic, MZaja, RFent, KSmital, T Molecular characterization of zebrafish Oatp1d1 (Slco1d1), a novel organic anion-transporting polypeptide. J Biol Chem 288:33894-911 (2013)  
Target
Name:
Solute carrier organic anion transporter family member
Synonyms:
Organic anion-transporting polypeptide 1D1 (Oatp1d1)
Type:
Protein
Mol. Mass.:
75011.81
Organism:
Danio rerio (Zebrafish)
Description:
A0A8M9PU70
Residue:
689
  
Inhibitor
Name:
BDBM50366524
Synonyms:
ESTRONE Estrone 3-sulfate | Estrone Sulphate
Type:
Small organic molecule
Emp. Form.:
C18H22O5S
Mol. Mass.:
350.429
SMILES:
C[C@]12CC[C@H]3[C@@H](CCc4cc(OS(O)(=O)=O)ccc34)[C@@H]1CCC2=O
: