Target
Solute carrier organic anion transporter family member
Ligand
BDBM18161
Substrate
Meas. Tech.
Oatp1d1 Transport Assay
Ki
2.34e+4±n/a nM
Citation
 Popovic, MZaja, RFent, KSmital, T Molecular characterization of zebrafish Oatp1d1 (Slco1d1), a novel organic anion-transporting polypeptide. J Biol Chem 288:33894-911 (2013)  
Target
Name:
Solute carrier organic anion transporter family member
Synonyms:
Organic anion-transporting polypeptide 1D1 (Oatp1d1)
Type:
Protein
Mol. Mass.:
75011.81
Organism:
Danio rerio (Zebrafish)
Description:
A0A8M9PU70
Residue:
689
  
Inhibitor
Name:
BDBM18161
Synonyms:
(1S,2S,7S,10R,11S,14S,15S)-14-hydroxy-2,15-dimethyltetracyclo[8.7.0.0^{2,7}.0^{11,15}]heptadecan-5-one CHEMBL27769 Dihydrotestosterone | [3H]DHT
Type:
Steroid
Emp. Form.:
C19H30O2
Mol. Mass.:
290.4403
SMILES:
[H][C@@]12CC[C@H](O)[C@@]1(C)CC[C@@]1([H])[C@@]2([H])CC[C@@]2([H])CC(=O)CC[C@]12C
: