Target
Solute carrier organic anion transporter family member
Ligand
BDBM13775
Substrate
Meas. Tech.
Oatp1d1 Transport Assay
Ki
1.20e+5±n/a nM
Citation
 Popovic, MZaja, RFent, KSmital, T Molecular characterization of zebrafish Oatp1d1 (Slco1d1), a novel organic anion-transporting polypeptide. J Biol Chem 288:33894-911 (2013)  
Target
Name:
Solute carrier organic anion transporter family member
Synonyms:
Organic anion-transporting polypeptide 1D1 (Oatp1d1)
Type:
Protein
Mol. Mass.:
75011.81
Organism:
Danio rerio (Zebrafish)
Description:
A0A8M9PU70
Residue:
689
  
Inhibitor
Name:
BDBM13775
Synonyms:
(1S,2R,10S,11S,14R,15S,17S)-14,17-dihydroxy-14-(2-hydroxyacetyl)-2,15-dimethyltetracyclo[8.7.0.0^{2,7}.0^{11,15}]heptadec-6-en-5-one 3H-cortisol US10188667, Example 00023 cortisol
Type:
Steroid
Emp. Form.:
C21H30O5
Mol. Mass.:
362.4599
SMILES:
[H][C@@]12CC[C@](O)(C(=O)CO)[C@@]1(C)C[C@H](O)[C@@]1([H])[C@@]2([H])CCC2=CC(=O)CC[C@]12C
: