Target
Solute carrier organic anion transporter family member
Ligand
BDBM50085042
Substrate
Meas. Tech.
Oatp1d1 Transport Assay
Ki
5.44e+4±n/a nM
Citation
 Popovic, MZaja, RFent, KSmital, T Molecular characterization of zebrafish Oatp1d1 (Slco1d1), a novel organic anion-transporting polypeptide. J Biol Chem 288:33894-911 (2013)  
Target
Name:
Solute carrier organic anion transporter family member
Synonyms:
Organic anion-transporting polypeptide 1D1 (Oatp1d1)
Type:
Protein
Mol. Mass.:
75011.81
Organism:
Danio rerio (Zebrafish)
Description:
A0A8M9PU70
Residue:
689
  
Inhibitor
Name:
BDBM50085042
Synonyms:
2-(4-(4-Chlorobenzoyl)phenoxy)-2-methylpropanoic acid 1-methylethyl ester FENOFIBRATE Fenofibric acid Isopropyl (4'-(p-chlorobenzoyl)-2-phenoxy-2-methyl)propionate Lipantil (TN) Tricor (TN) | propan-2-yl 2-[4-(4-chlorobenzoyl)phenoxy]-2-methylpropanoate
Type:
Small organic molecule
Emp. Form.:
C20H21ClO4
Mol. Mass.:
360.831
SMILES:
CC(C)OC(=O)C(C)(C)Oc1ccc(cc1)C(=O)c1ccc(Cl)cc1
: