Target
Aldo-keto reductase family 1 member C2
Ligand
BDBM220116
Substrate
Meas. Tech.
Discontinuous Radiometric Assay
Ki
>100000±n/a nM
Citation
 Penning, TMAdeniji, AOBurns, MCWinkler, JTwenter, B Bifunctional AKR1C3 inhibitors/androgen receptor modulators and methods of use thereof US Patent  US9271961 Publication Date 3/1/2016 
Target
Name:
Aldo-keto reductase family 1 member C2
Synonyms:
3-alpha-HSD3 AK1C2_HUMAN Aldo-keto reductase family 1 member C2 (AK1C2) Aldo-keto reductase family 1 member C2 (AKR1C2) DD-2 DDH2 Dihydrodiol dehydrogenase/bile acid-binding protein Type III 3-alpha-hydroxysteroid dehydrogenase
Type:
Enzyme
Mol. Mass.:
36739.89
Organism:
Homo sapiens (Human)
Description:
Residue:
323
  
Inhibitor
Name:
BDBM220116
Synonyms:
US9271961, CBM
Type:
Small organic molecule
Emp. Form.:
C19H17ClN2O3
Mol. Mass.:
356.803
SMILES:
COc1ccc2n(cc(CNC(C)=O)c2c1)C(=O)c1ccc(Cl)cc1
: