Target
Aldo-keto reductase family 1 member C1
Ligand
BDBM220117
Substrate
Meas. Tech.
Discontinuous Radiometric Assay
Ki
2660±n/a nM
Citation
 Penning, TMAdeniji, AOBurns, MCWinkler, JTwenter, B Bifunctional AKR1C3 inhibitors/androgen receptor modulators and methods of use thereof US Patent  US9271961 Publication Date 3/1/2016 
Target
Name:
Aldo-keto reductase family 1 member C1
Synonyms:
20-alpha-HSD AK1C1_HUMAN Aldo-keto reductase family 1 member C1 (AK1C1) Aldo-keto reductase family 1 member C1 (AKR1C1) DDH High-affinity hepatic bile acid-binding protein | Trans-1,2-dihydrobenzene-1,2-diol dehydrogenase
Type:
Enzyme
Mol. Mass.:
36793.97
Organism:
Homo sapiens (Human)
Description:
Recombinant AKR1C1 enzyme was expressed in E. coli.
Residue:
323
  
Inhibitor
Name:
BDBM220117
Synonyms:
US9271961, 4-Carboxy-2',4'-dinitrodiphenylamine
Type:
Small organic molecule
Emp. Form.:
C13H9N3O6
Mol. Mass.:
303.2271
SMILES:
OC(=O)c1cccc(Nc2ccc(cc2N(=O)=O)N(=O)=O)c1
: