Target
Acetyl-CoA carboxylase 1 [39-2346]
Ligand
BDBM220133
Substrate
Meas. Tech.
Human ACC1 Enzyme Assay
pH
7.5±n/a
Temperature
295.15±n/a K
IC50
67±n/a nM
Comments
extracted
Citation
 Liu, NThede, KMönning, UScholz, AHilger, CBömer, UFischer, R Substituted 3-(biphenyl-3-yl)-4-hydroxy-8-methoxy-1-azaspiro[4.5]dec-3-en-2-one US Patent  US9278925 Publication Date 3/8/2016 
Target
Name:
Acetyl-CoA carboxylase 1 [39-2346]
Synonyms:
ACAC ACACA_HUMAN ACCA | Acetyl-CoA carboxylase 1
Type:
Protein
Mol. Mass.:
261327.19
Organism:
Homo sapiens (Human)
Description:
amino acids 39-end
Residue:
2308
  
Inhibitor
Name:
BDBM220133
Synonyms:
US9278925, V.2-a | US9278925, V.4-a
Type:
Small organic molecule
Emp. Form.:
C24H25ClFNO3
Mol. Mass.:
429.912
SMILES:
CO[C@@]1(C)CC[C@@]2(CC1)NC(=O)C(=C2O)c1cc(ccc1C)-c1ccc(Cl)c(F)c1
: