Target
Diacylglycerol O-acyltransferase 1
Ligand
BDBM220402
Substrate
Meas. Tech.
PMSA Inhibition Assay
Ki
1.35±0.54 nM
IC50
30.5±12.1 nM
Citation
 Spiegel, DMurelli, RZhang, A Chimeric small molecules for the recruitment of antibodies to cancer cells US Patent  US9296708 Publication Date 3/29/2016 
Target
Name:
Diacylglycerol O-acyltransferase 1
Synonyms:
ACAT-related gene product 1 Acyl coA-diacylglycerol acyl transferase 1 (DGAT1) DGAT1 Diacylglycerol Acyltransferase (DGAT1) Diacylglycerol O-acyltransferase 1 (DGAT1) | Diglyceride acyltransferase
Type:
Protein
Mol. Mass.:
55297.82
Organism:
Homo sapiens (Human)
Description:
O75907
Residue:
488
  
Inhibitor
Name:
BDBM220402
Synonyms:
US9296708, 8, MeO-P0
Type:
Small organic molecule
Emp. Form.:
C16H25N5O8
Mol. Mass.:
415.3984
SMILES:
COCc1cn(CCCC[C@H](NC(=O)N[C@@H](CCC(O)=O)C(O)=O)C(O)=O)nn1
: