Target
Diacylglycerol O-acyltransferase 1
Ligand
BDBM220406
Substrate
Meas. Tech.
PMSA Inhibition Assay
Ki
7.3±2.6 nM
IC50
165.2±58.9 nM
Citation
 Spiegel, DMurelli, RZhang, A Chimeric small molecules for the recruitment of antibodies to cancer cells US Patent  US9296708 Publication Date 3/29/2016 
Target
Name:
Diacylglycerol O-acyltransferase 1
Synonyms:
ACAT-related gene product 1 Acyl coA-diacylglycerol acyl transferase 1 (DGAT1) DGAT1 Diacylglycerol Acyltransferase (DGAT1) Diacylglycerol O-acyltransferase 1 (DGAT1) | Diglyceride acyltransferase
Type:
Protein
Mol. Mass.:
55297.82
Organism:
Homo sapiens (Human)
Description:
O75907
Residue:
488
  
Inhibitor
Name:
BDBM220406
Synonyms:
US9296708, 12, MeO-P12
Type:
Small organic molecule
Emp. Form.:
C40H73N5O20
Mol. Mass.:
944.0291
SMILES:
c1cn(CCCC[C@H](NC(=O)N[C@@H](CCC(O)=O)C(O)=O)C(O)=O)nn1
: