Target
Diacylglycerol O-acyltransferase 1
Ligand
BDBM221010
Substrate
Meas. Tech.
DGAT1 Inhibitory Assay
pH
7.4±n/a
Temperature
303.15±n/a K
IC50
2.2±n/a nM
Comments
extracted
Citation
 Sakurai, OSaruta, KHayashi, NGoi, TMorokuma, KTsujishima, HSawamoto, HShitama, HImashiro, R Continuous arycyclic compound US Patent  US9302996 Publication Date 4/5/2016 
Target
Name:
Diacylglycerol O-acyltransferase 1
Synonyms:
ACAT-related gene product 1 Acyl coA-diacylglycerol acyl transferase 1 (DGAT1) DGAT1 Diacylglycerol Acyltransferase (DGAT1) Diacylglycerol O-acyltransferase 1 (DGAT1) | Diglyceride acyltransferase
Type:
Protein
Mol. Mass.:
55297.82
Organism:
Homo sapiens (Human)
Description:
O75907
Residue:
488
  
Inhibitor
Name:
BDBM221010
Synonyms:
US9302996, 125
Type:
Small organic molecule
Emp. Form.:
C22H19ClF5N3O3
Mol. Mass.:
503.85
SMILES:
Cc1cc(OCC(C)(C)C(O)=O)ncc1-c1ccc(-c2ncc([nH]2)C(F)(F)C(F)(F)F)c(Cl)c1
: