Target
Oligo-1,6-glucosidase IMA1
Ligand
BDBM222219
Substrate
Meas. Tech.
α-Glucosidase Inhibition Assay
IC50
7.81e+3± 1 nM
Citation
 Chaudhry, FNaureen, SHuma, RShaukat, AAl-Rashida, MAsif, NAshraf, MMunawar, MAKhan, MA In search of new a-glucosidase inhibitors: Imidazolylpyrazole derivatives. Bioorg Chem 71:102-109 (2017)  
Target
Name:
Oligo-1,6-glucosidase IMA1
Synonyms:
α-glucosidase Alpha-glucosidase (α-glucosidase) MALX3_YEAST | Oligo-1,6-glucosidase
Type:
Protein
Mol. Mass.:
68577.59
Organism:
Saccharomyces cerevisiae S288c (Baker's yeast)
Description:
Residue:
589
  
Inhibitor
Name:
BDBM222219
Synonyms:
4-(4,5-Diphenyl-1H-imidazol-2-yl)-1-(4-nitrophenyl)-3-phenyl-1H-pyrazole (2h)
Type:
Small organic molecule
Emp. Form.:
C30H21N5O2
Mol. Mass.:
483.52
SMILES:
[O-][N+](=O)c1ccc(cc1)-n1cc(-c2nc(c([nH]2)-c2ccccc2)-c2ccccc2)c(n1)-c1ccccc1
: