Target
Intestinal-type alkaline phosphatase
Ligand
BDBM222258
Substrate
Meas. Tech.
Alkaline Phosphatase Assay
pH
9.8±n/a
Temperature
310.15±n/a K
IC50
1.2e+2± 2e+1 nM
Comments
extracted
Citation
 Ejaz, SASaeed, ASiddique, MNNisa, ZUKhan, SLecka, JSévigny, JIqbal, J Synthesis, characterization and biological evaluation of novel chalcone sulfonamide hybrids as potent intestinal alkaline phosphatase inhibitors. Bioorg Chem 70:229-236 (2017)  
Target
Name:
Intestinal-type alkaline phosphatase
Synonyms:
ALPI Intestinal alkaline phosphatase (IAP) PPBI_BOVIN
Type:
Protein
Mol. Mass.:
57094.82
Organism:
Bos taurus (Cattle)
Description:
P19111
Residue:
533
  
Inhibitor
Name:
BDBM222258
Synonyms:
(Z)-4-(2-((E)-4-(2-chlorophenyl)-1-morpholino-2-oxobut-3-enylidene)hydrazinyl) benzenesulfonamide (4a)
Type:
Small organic molecule
Emp. Form.:
C20H21ClN4O4S
Mol. Mass.:
448.923
SMILES:
NS(=O)(=O)c1ccc(N\N=C(/N2CCOCC2)C(=O)\C=C\c2ccccc2Cl)cc1
: