Target
Carboxylic ester hydrolase
Ligand
BDBM10404
Substrate
Meas. Tech.
Cholinesterase Inhibition Assay
IC50
2770±150 nM
Citation
 Krátký, M?tepánková, Ĺ Vorcáková, KNavrátilová, LTrejtnar, FStolaríková, JVin?ová, J Synthesis of readily available fluorophenylalanine derivatives and investigation of their biological activity. Bioorg Chem 71:244-256 (2017)  
Target
Name:
Carboxylic ester hydrolase
Synonyms:
BuChE Butyrylcholine esterase Butyrylcholinesterase (BChE) Butyrylcholinesterase (EqBuChE) butyrylcholinesterase precursor
Type:
Protein
Mol. Mass.:
68842.83
Organism:
Equus caballus (Horse)
Description:
Q9N1N9
Residue:
602
  
Inhibitor
Name:
BDBM10404
Synonyms:
(1S,12S,14R)-9-methoxy-4-methyl-11-oxa-4-azatetracyclo[8.6.1.0^{1,12}.0^{6,17}]heptadeca-6,8,10(17),15-tetraen-14-ol GALANTAMINE HYDROBROMIDE Galanthamine Lycoremine Nivaline Reminyl US9586925, Galantamine | galantamine
Type:
Small organic molecule
Emp. Form.:
C17H21NO3
Mol. Mass.:
287.3535
SMILES:
COc1ccc2CN(C)CC[C@@]34C=C[C@H](O)C[C@@H]3Oc1c24
: