Target
Lysophosphatidic acid receptor 1
Ligand
BDBM251681
Substrate
Meas. Tech.
In Vitro LPA1 Receptor Assay
Temperature
298.15±n/a K
IC50
1.000±n/a nM
Comments
extracted
Citation
 Buffham, WCanning, HDavenport, RFarnaby, WMack, SParmar, AWright, S Amide derivatives as lysophosphatidic acid receptor antagonists US Patent  US10100018 Publication Date 10/16/2018 
Target
Name:
Lysophosphatidic acid receptor 1
Synonyms:
EDG2 LPA-1 LPAR1 Lysophosphatidic acid receptor 1 (LPA1) | Lysophosphatidic acid receptor Edg-2
Type:
Enzyme
Mol. Mass.:
41120.55
Organism:
Homo sapiens (Human)
Description:
Q92633
Residue:
364
  
Inhibitor
Name:
BDBM251681
Synonyms:
US10100018, Example 17 | US9464060, 17
Type:
Small organic molecule
Emp. Form.:
C30H25F2NO4
Mol. Mass.:
501.5206
SMILES:
OC(=O)c1ccc(CN(CCCc2cccc(F)c2)C(=O)c2ccc(Oc3ccccc3F)cc2)cc1
: