Target
Lysophosphatidic acid receptor 1
Ligand
BDBM251688
Substrate
Meas. Tech.
In Vitro LPA1 Receptor Assay
Temperature
298.15±n/a K
IC50
7.00±n/a nM
Comments
extracted
Citation
 Buffham, WCanning, HDavenport, RFarnaby, WMack, SParmar, AWright, S Amide derivatives as lysophosphatidic acid receptor antagonists US Patent  US10100018 Publication Date 10/16/2018 
Target
Name:
Lysophosphatidic acid receptor 1
Synonyms:
EDG2 LPA-1 LPAR1 Lysophosphatidic acid receptor 1 (LPA1) | Lysophosphatidic acid receptor Edg-2
Type:
Enzyme
Mol. Mass.:
41120.55
Organism:
Homo sapiens (Human)
Description:
Q92633
Residue:
364
  
Inhibitor
Name:
BDBM251688
Synonyms:
US10100018, Example 24 | US9464060, 24
Type:
Small organic molecule
Emp. Form.:
C29H25NO4
Mol. Mass.:
451.5131
SMILES:
Cc1ccccc1Oc1ccc(cc1)C(=O)N(Cc1ccccc1)Cc1ccc(cc1)C(O)=O
: