Target
Lysophosphatidic acid receptor 1
Ligand
BDBM251726
Substrate
Meas. Tech.
In Vitro LPA1 Receptor Assay
Temperature
298.15±n/a K
IC50
5.00±n/a nM
Comments
extracted
Citation
 Buffham, WCanning, HDavenport, RFarnaby, WMack, SParmar, AWright, S Amide derivatives as lysophosphatidic acid receptor antagonists US Patent  US10100018 Publication Date 10/16/2018 
Target
Name:
Lysophosphatidic acid receptor 1
Synonyms:
EDG2 LPA-1 LPAR1 Lysophosphatidic acid receptor 1 (LPA1) | Lysophosphatidic acid receptor Edg-2
Type:
Enzyme
Mol. Mass.:
41120.55
Organism:
Homo sapiens (Human)
Description:
Q92633
Residue:
364
  
Inhibitor
Name:
BDBM251726
Synonyms:
US10100018, Example 62 | US9464060, 62
Type:
Small organic molecule
Emp. Form.:
C25H25NO5
Mol. Mass.:
419.4697
SMILES:
CCCN(Cc1ccc(cc1)C(O)=O)C(=O)c1ccc(Oc2ccccc2OC)cc1
: