Target
Leukotriene C4 synthase
Ligand
BDBM223290
Substrate
LTC4
Meas. Tech.
In Vitro hLTC4 Synthase Enzyme Assay (Test B)
pH
7.5±n/a
IC50
0.658±n/a nM
Comments
extracted
Citation
 Ronn, RLindh, CJRingberg, EAndersson, HBNilsson, PSchaal, WRRosenschold, MMNikitidis, ANikitidis, GJohannesson, PTyrcha, C Compounds and uses  US Patent  US20160326143 Publication Date 11/10/2016 
Target
Name:
Leukotriene C4 synthase
Synonyms:
LTC4 synthase LTC4S_HUMAN | Leukotriene-C(4) synthase
Type:
PROTEIN
Mol. Mass.:
16575.59
Organism:
Homo sapiens (Human)
Description:
ChEMBL_961179
Residue:
150
  
Inhibitor
Name:
BDBM223290
Synonyms:
(1S,2S)-2-[(5-{[2-Fluoro-5-(trifluoromethyl)phenyl](2-methylpropyl)amino}-3-methoxypyridin-2-yl)carbonyl]cyclopropanecarboxylic acid US9657001, 65
Type:
Small Organic Molecule
Emp. Form.:
C22H22F4N2O4
Mol. Mass.:
454.4147
SMILES:
COc1cc(cnc1C(=O)[C@H]1C[C@@H]1C(O)=O)N(CC(C)C)c1cc(ccc1F)C(F)(F)F
:
Substrate
Name:
BDBM81801
Synonyms:
CAS_5283121 NSC_5283121
Type:
Small organic molecule
Emp. Form.:
C30H47N3O9S
Mol. Mass.:
625.774
SMILES:
CCCCCC=CCC=CC=CC=CC(SCC(NC(=O)CCC(N)C(O)=O)C(=O)NCC(O)=O)C(O)CCCC(O)=O
: