Target
Caspase-4
Ligand
BDBM85511
Substrate
Meas. Tech.
Caspase Catalytic Activity Assay
pH
7.4±n/a
IC50
8.6e+2± 7e+1 nM
Comments
extracted
Citation
 Smith, CESoti, SJones, TANakagawa, AXue, DYin, H Non-steroidal Anti-inflammatory Drugs Are Caspase Inhibitors. Cell Chem Biol 24:281-292 (2017)  
Target
Name:
Caspase-4
Synonyms:
CASP-4 CASP4_HUMAN Caspase-4 subunit 1 ICE(rel)-II ICH2 | TX protease
Type:
Enzyme
Mol. Mass.:
43257.75
Organism:
Homo sapiens (Human)
Description:
P49662
Residue:
377
  
Inhibitor
Name:
BDBM85511
Synonyms:
CAS_74103-07-4 Ketorolac tris salt | Toradol
Type:
Small organic molecule
Emp. Form.:
C15H13NO3
Mol. Mass.:
255.2686
SMILES:
OC(=O)C1CCn2c1ccc2C(=O)c1ccccc1
: