Target
Aldehyde dehydrogenase, dimeric NADP-preferring
Ligand
BDBM50447073
Substrate
Meas. Tech.
Inhibiton Assay
pH
7.5±n/a
IC50
1500±500 nM
Comments
extracted
Citation
 Hurley, TD Regulators of aldehyde dehydrogenase ALDH3A1 and related therapeutic methods US Patent  US9320722 Publication Date 4/26/2016 
Target
Name:
Aldehyde dehydrogenase, dimeric NADP-preferring
Synonyms:
AL3A1_HUMAN ALDH3A1 Aldehyde dehydrogenase family 3 member A1 (ALDH3A1) | Aldehyde dehydrogenase family 3 member A1 (ALDH3A1) (Q122A)
Type:
Protein
Mol. Mass.:
50394.38
Organism:
Homo sapiens (Human)
Description:
Residue:
453
  
Inhibitor
Name:
BDBM50447073
Synonyms:
CHEMBL1493289 | US9328112, A21
Type:
Small organic molecule
Emp. Form.:
C13H9ClN2O2S
Mol. Mass.:
292.741
SMILES:
Clc1ccc(cc1)S(=O)(=O)n1cnc2ccccc12
: