Target
Aldehyde dehydrogenase, dimeric NADP-preferring
Ligand
BDBM50447058
Substrate
Meas. Tech.
Inhibiton Assay
pH
7.5±n/a
IC50
900±200 nM
Comments
extracted
Citation
 Hurley, TD Regulators of aldehyde dehydrogenase ALDH3A1 and related therapeutic methods US Patent  US9320722 Publication Date 4/26/2016 
Target
Name:
Aldehyde dehydrogenase, dimeric NADP-preferring
Synonyms:
AL3A1_HUMAN ALDH3A1 Aldehyde dehydrogenase family 3 member A1 (ALDH3A1) | Aldehyde dehydrogenase family 3 member A1 (ALDH3A1) (Q122A)
Type:
Protein
Mol. Mass.:
50394.38
Organism:
Homo sapiens (Human)
Description:
Residue:
453
  
Inhibitor
Name:
BDBM50447058
Synonyms:
CHEMBL1308268 | US9328112, A70
Type:
Small organic molecule
Emp. Form.:
C15H13FN2O3S
Mol. Mass.:
320.339
SMILES:
COc1cc(ccc1F)S(=O)(=O)n1c(C)nc2ccccc12
: