Target
Histone-lysine N-methyltransferase KMT5B
Ligand
BDBM223981
Substrate
Meas. Tech.
Scintillation Proximity Assay (SPA)
pH
8±0
Temperature
298.15±0 K
IC50
25±n/a nM
Citation
 Bromberg, KDMitchell, TRUpadhyay, AKJakob, CGJhala, MAComess, KMLasko, LMLi, CTuzon, CTDai, YLi, FEram, MSNuber, ASoni, NBManaves, VAlgire, MASweis, RFTorrent, MSchotta, GSun, CMichaelides, MRShoemaker, ARArrowsmith, CHBrown, PJSanthakumar, VMartin, ARice, JCChiang, GGVedadi, MBarsyte-Lovejoy, DPappano, WN The SUV4-20 inhibitor A-196 verifies a role for epigenetics in genomic integrity. Nat Chem Biol 13:317-324 (2017)  
Target
Name:
Histone-lysine N-methyltransferase KMT5B
Synonyms:
Histone-lysine N-methyltransferase SUV420H1 KMT5B_HUMAN Protein lysine methyltransferase SUV4-20H1 (SUV4-20H1) Su(var)4-20 homolog 1 Suv4-20h1
Type:
Enzyme
Mol. Mass.:
99219.53
Organism:
Homo sapiens (Human)
Description:
Q4FZB7
Residue:
885
  
Inhibitor
Name:
BDBM223981
Synonyms:
6,7-Dichloro-N-cyclopentyl-4-(pyridin-4-yl)phthalazin-1-amine | A-196 (3)
Type:
Small organic molecule
Emp. Form.:
C18H16Cl2N4
Mol. Mass.:
359.252
SMILES:
Clc1cc2c(NC3CCCC3)nnc(-c3ccncc3)c2cc1Cl
: