Target
Oxysterol-binding protein 2
Ligand
BDBM20192
Substrate
Meas. Tech.
Sterol-Binding Assay
pH
7.4±n/a
Temperature
293.15±n/a K
Kd
68±0.0 nM
Comments
extracted
Citation
 Charman, MColbourne, TRPietrangelo, AKreplak, LRidgway, ND Oxysterol-binding protein (OSBP)-related protein 4 (ORP4) is essential for cell proliferation and survival. J Biol Chem 289:15705-17 (2014)  
Target
Name:
Oxysterol-binding protein 2
Synonyms:
KIAA1664 OSBP-related protein 4 (ORP4L) OSBP2_HUMAN | OSBPL4
Type:
Protein
Mol. Mass.:
101264.66
Organism:
Homo sapiens (Human)
Description:
Q969R2
Residue:
916
  
Inhibitor
Name:
BDBM20192
Synonyms:
(1S,2R,5S,10S,11S,14R,15R)-2,15-dimethyl-14-[(2R)-6-methylheptan-2-yl]tetracyclo[8.7.0.0^{2,7}.0^{11,15}]heptadec-7-en-5-ol | cholesterol
Type:
Steroid
Emp. Form.:
C27H46O
Mol. Mass.:
386.6535
SMILES:
[H][C@@]1(CC[C@@]2([H])[C@]3([H])CC=C4C[C@@H](O)CC[C@]4(C)[C@@]3([H])CC[C@]12C)[C@H](C)CCCC(C)C
: