Target
Aldo-keto reductase family 1 member B1
Ligand
BDBM16239
Substrate
Meas. Tech.
SPR Assay
pH
8.5±n/a
Kd
14±0.0 nM
Comments
extracted
Citation
 Rechlin, CScheer, FTerwesten, FWulsdorf, TPol, EFridh, VToth, PDiederich, WEHeine, AKlebe, G Price for Opening the Transient Specificity Pocket in Human Aldose Reductase upon Ligand Binding: Structural, Thermodynamic, Kinetic, and Computational Analysis. ACS Chem Biol 12:1397-1415 (2017)  
Target
Name:
Aldo-keto reductase family 1 member B1
Synonyms:
AKR1B1 ALDR_HUMAN AR Aldose Reductase (ALR2) Aldose reductase (AR)
Type:
Protein
Mol. Mass.:
35855.50
Organism:
Homo sapiens (Human)
Description:
P15121. 4LAU; 2IKI; 4LB4; 2FZD; 2FZ8; 1US0
Residue:
316
  
Inhibitor
Name:
BDBM16239
Synonyms:
2-(5-chloro-2-{[(3-nitrophenyl)methyl]carbamoyl}phenoxy)acetic acid IDD 393 {5-chloro-2-[(3-nitrobenzyl)carbamoyl]phenoxy}acetic acid
Type:
Small organic molecule
Emp. Form.:
C16H13ClN2O6
Mol. Mass.:
364.737
SMILES:
OC(=O)COc1cc(Cl)ccc1C(=O)NCc1cccc(c1)[N+]([O-])=O
: