Target
Aldo-keto reductase family 1 member C3
Ligand
BDBM50293598
Substrate
Meas. Tech.
Inhibition Assay
IC50
0.96±n/a nM
Citation
 Marnett, LJLiedtke, AJPenning, TMAdeniji, AOByrns, MC Indomethacin analogs for the treatment of castrate-resistant prostate cancer US Patent  US9346803 Publication Date 5/24/2016 
Target
Name:
Aldo-keto reductase family 1 member C3
Synonyms:
17-beta-Hydroxysteroid Dehydrogenase 5 (17-beta-HSD5, AKR1C3) AK1C3_HUMAN Aldo-keto reductase family 1 member C3 Aldo-keto reductase family 1 member C3 (AK1C3a) Aldo-keto-reductase family 1 member C3 Dihydrodiol dehydrogenase 3 Estradiol 17-beta-dehydrogenase KIAA0119 Prostaglandin F synthase Trans-1,2-dihydrobenzene-1,2-diol dehydrogenase
Type:
Enzyme
Mol. Mass.:
36859.86
Organism:
Homo sapiens (Human)
Description:
P42330
Residue:
323
  
Inhibitor
Name:
BDBM50293598
Synonyms:
2'-des-methyl indomethacin US9346803, Des-methylIndomethacin
Type:
Small organic molecule
Emp. Form.:
C18H14ClNO4
Mol. Mass.:
343.761
SMILES:
COc1ccc2n(cc(CC(O)=O)c2c1)C(=O)c1ccc(Cl)cc1
: