Target
Aldo-keto reductase family 1 member C1
Ligand
BDBM50293598
Substrate
Meas. Tech.
Inhibition Assay
IC50
>100±n/a nM
Citation
 Marnett, LJLiedtke, AJPenning, TMAdeniji, AOByrns, MC Indomethacin analogs for the treatment of castrate-resistant prostate cancer US Patent  US9346803 Publication Date 5/24/2016 
Target
Name:
Aldo-keto reductase family 1 member C1
Synonyms:
20-alpha-HSD AK1C1_HUMAN Aldo-keto reductase family 1 member C1 (AK1C1) Aldo-keto reductase family 1 member C1 (AKR1C1) DDH High-affinity hepatic bile acid-binding protein | Trans-1,2-dihydrobenzene-1,2-diol dehydrogenase
Type:
Enzyme
Mol. Mass.:
36793.97
Organism:
Homo sapiens (Human)
Description:
Recombinant AKR1C1 enzyme was expressed in E. coli.
Residue:
323
  
Inhibitor
Name:
BDBM50293598
Synonyms:
2'-des-methyl indomethacin US9346803, Des-methylIndomethacin
Type:
Small organic molecule
Emp. Form.:
C18H14ClNO4
Mol. Mass.:
343.761
SMILES:
COc1ccc2n(cc(CC(O)=O)c2c1)C(=O)c1ccc(Cl)cc1
: