Target
Aldo-keto reductase family 1 member C1
Ligand
BDBM50427628
Substrate
Meas. Tech.
Inhibition Assay
IC50
100±n/a nM
Citation
 Marnett, LJLiedtke, AJPenning, TMAdeniji, AOByrns, MC Indomethacin analogs for the treatment of castrate-resistant prostate cancer US Patent  US9346803 Publication Date 5/24/2016 
Target
Name:
Aldo-keto reductase family 1 member C1
Synonyms:
20-alpha-HSD AK1C1_HUMAN Aldo-keto reductase family 1 member C1 (AK1C1) Aldo-keto reductase family 1 member C1 (AKR1C1) DDH High-affinity hepatic bile acid-binding protein | Trans-1,2-dihydrobenzene-1,2-diol dehydrogenase
Type:
Enzyme
Mol. Mass.:
36793.97
Organism:
Homo sapiens (Human)
Description:
Recombinant AKR1C1 enzyme was expressed in E. coli.
Residue:
323
  
Inhibitor
Name:
BDBM50427628
Synonyms:
CHEMBL2323472 | US9346803, Table 2, Compound 8: 2-{1-[4-(chloromethyl)benzoyl]-5-methoxy-2-methyl-1H-indol-3-yl}acetic acid
Type:
Small organic molecule
Emp. Form.:
C20H18ClNO4
Mol. Mass.:
371.814
SMILES:
COc1ccc2n(C(=O)c3ccc(CCl)cc3)c(C)c(CC(O)=O)c2c1
: