Target
Thiol:disulfide interchange protein [27-205]
Ligand
BDBM231639
Substrate
Meas. Tech.
Isothermal Titration Calorimetry (ITC)
pH
7.4±0
Temperature
298.15±0 K
Kd
162±9 nM
Citation
 Premkumar, LKurth, FDuprez, WGrøftehauge, MKKing, GJHalili, MAHeras, BMartin, JL Structure of the Acinetobacter baumannii dithiol oxidase DsbA bound to elongation factor EF-Tu reveals a novel protein interaction site. J Biol Chem 289:19869-80 (2014)  
Target
Name:
Thiol:disulfide interchange protein [27-205]
Synonyms:
F0KIP0_ACICP dsbA
Type:
Protein
Mol. Mass.:
20389.27
Organism:
Acinetobacter baumannii (AYE strain)
Description:
A. baumannii DsbA lacking the predicted periplasmic leader sequence (27-205 aa)
Residue:
179
  
Inhibitor
Name:
BDBM231639
Synonyms:
AFDQIDNAPEE
Type:
Small organic molecule
Emp. Form.:
C53H77N13O22
Mol. Mass.:
1248.2524
SMILES:
CC[C@H](C)[C@H](NC(=O)[C@H](CCC(N)=O)NC(=O)[C@H](CC(O)=O)NC(=O)[C@H](Cc1ccccc1)NC(=O)[C@H](C)N)C(=O)N[C@@H](CC(O)=O)C(=O)N[C@@H](CC(N)=O)C(=O)N[C@@H](C)C(=O)N1CCC[C@H]1C(=O)N[C@@H](CCC(O)=O)C(=O)N[C@@H](CCC(O)=O)C(O)=O
: