Target
Tyrosine-protein kinase ABL2 [121-226]
Ligand
BDBM231648
Substrate
Meas. Tech.
Fluorescence Polarization Assay
pH
7.25±n/a
Kd
5.8e+2± 1.5e+2 nM
Comments
extracted
Citation
 Gifford, SMLiu, WMader, CCHalo, TLMachida, KBoggon, TJKoleske, AJ Two amino acid residues confer different binding affinities of Abelson family kinase SRC homology 2 domains for phosphorylated cortactin. J Biol Chem 289:19704-13 (2014)  
Target
Name:
Tyrosine-protein kinase ABL2 [121-226]
Synonyms:
ABL2 ABLL Abelson tyrosine-kinase 2 SH2 domain (Arg SH2)
Type:
Protein
Mol. Mass.:
11881.50
Organism:
Homo sapiens (Human)
Description:
Truncated human Arg (121-226 aa)
Residue:
106
  
Inhibitor
Name:
BDBM231648
Synonyms:
SEPVpYETTE | pY466
Type:
Small organic molecule
Emp. Form.:
C45H68N9O23P
Mol. Mass.:
1134.0417
SMILES:
CC(C)[C@H](NC(=O)[C@@H]1CCCN1C(=O)[C@H](CCC(O)=O)NC(=O)[C@@H](N)CO)C(=O)N[C@@H](Cc1ccc(OP(O)(O)=O)cc1)C(=O)N[C@@H](CCC(O)=O)C(=O)N[C@@H]([C@@H](C)O)C(=O)N[C@@H]([C@@H](C)O)C(=O)N[C@@H](CCC(O)=O)C(O)=O
: