Target
6-phosphogluconate dehydrogenase, decarboxylating
Ligand
BDBM233150
Substrate
Meas. Tech.
In Vitro Assay
Ki
73400000±21900000 nM
IC50
209100000±0.0 nM
Citation
 Akkemik, EBudak, HCiftci, M Effects of some drugs on human erythrocyte 6-phosphogluconate dehydrogenase: an in vitro study. J Enzyme Inhib Med Chem 25:476-9 (2010)  
Target
Name:
6-phosphogluconate dehydrogenase, decarboxylating
Synonyms:
6-phosphogluconate dehydrogenase 6PGD_HUMAN PGDH
Type:
Protein
Mol. Mass.:
53143.42
Organism:
Homo sapiens (Human)
Description:
P52209
Residue:
483
  
Inhibitor
Name:
BDBM233150
Synonyms:
Gadopentetic acid
Type:
Small organic molecule
Emp. Form.:
C14H20N3O10
Mol. Mass.:
390.3243
SMILES:
OC(=O)CN(CCN(CCN(CC(O)=O)CC([O-])=O)CC([O-])=O)CC([O-])=O
: