Target
Glucose-6-phosphate 1-dehydrogenase
Ligand
BDBM233195
Substrate
Meas. Tech.
In Vitro Inhibition Assay
Ki
4.2867e+6± 1.067e+6 nM
IC50
2.280e+6±n/a nM
Citation
 Akkemik, EBudak, HCiftci, M Effects of some drugs on human erythrocyte glucose 6-phosphate dehydrogenase: an in vitro study. J Enzyme Inhib Med Chem 25:871-5 (2010)  
Target
Name:
Glucose-6-phosphate 1-dehydrogenase
Synonyms:
G6PD Glucose 6-phosphate dehydrogenase (G6PD) glucose-6-phosphate 1-dehydrogenase isoform b
Type:
Enzyme
Mol. Mass.:
59258.58
Organism:
Homo sapiens (Human)
Description:
P11413
Residue:
515
  
Inhibitor
Name:
BDBM233195
Synonyms:
Paricalcitol
Type:
Small organic molecule
Emp. Form.:
C27H44O3
Mol. Mass.:
416.6365
SMILES:
[#6]-[#6@H](\[#6]=[#6]\[#6@H](-[#6])C([#6])([#6])[#8])-[#6@H]1-[#6]-[#6]-[#6@H]2\[#6](-[#6]-[#6]-[#6][C@]12[#6])=[#6]\[#6]=[#6]-1/[#6]-[#6@@H](-[#8])-[#6]-[#6@H](-[#8])-[#6]-1
: