Target
UDP-glucuronosyltransferase 1-6
Ligand
BDBM50027886
Substrate
1-Naphthol
Meas. Tech.
UDP-glucuronosyltransferase Activity Assay
IC50
2.81e+5± 6.9e+4 nM
Citation
 Liu, YShe, MWu, ZDai, R The inhibition study of human UDP-glucuronosyltransferases with cytochrome P450 selective substrates and inhibitors. J Enzyme Inhib Med Chem 26:386-93 (2011)  
Target
Name:
UDP-glucuronosyltransferase 1-6
Synonyms:
GNT1 UD16_HUMAN UDP-glucuronosyltransferase 1-F UDPGT 1-6 UGT1 UGT1-06 UGT1A6 Uridine-5'-diphosphoglucuronosyltransferase 1A6
Type:
Enzyme
Mol. Mass.:
60765.14
Organism:
Homo sapiens (Human)
Description:
P19224
Residue:
532
  
Inhibitor
Name:
BDBM50027886
Synonyms:
1-Butyl-3-(p-methylphenylsulfonyl)urea 1-Butyl-3-tosylurea N-(4-Methylphenylsulfonyl)-N'-butylurea N-Butyl-N'-(p-tolylsulfonyl)urea N-n-Butyl-N'-tosylurea TOLBUTAMIDE
Type:
Small organic molecule
Emp. Form.:
C12H18N2O3S
Mol. Mass.:
270.348
SMILES:
CCCCNC(=O)NS(=O)(=O)c1ccc(C)cc1
:
Substrate
Name:
BDBM23450
Synonyms:
1-Naphthalenol CHEMBL122617 alpha-naphthol | naphthalen-1-ol
Type:
Small organic molecule
Emp. Form.:
C10H8O
Mol. Mass.:
144.1699
SMILES:
Oc1cccc2ccccc12
: