Target
UDP-glucuronosyltransferase 2B10
Ligand
BDBM50090677
Substrate
Diclofenac
Meas. Tech.
UDP-glucuronosyltransferase Activity Assay
IC50
>3.00e+5±n/a nM
Citation
 Liu, YShe, MWu, ZDai, R The inhibition study of human UDP-glucuronosyltransferases with cytochrome P450 selective substrates and inhibitors. J Enzyme Inhib Med Chem 26:386-93 (2011)  
Target
Name:
UDP-glucuronosyltransferase 2B10
Synonyms:
UDB10_HUMAN Uridine-5'-diphosphoglucuronosyltransferase 2B10
Type:
Enzyme
Mol. Mass.:
60792.40
Organism:
Homo sapiens (Human)
Description:
P36537
Residue:
528
  
Inhibitor
Name:
BDBM50090677
Synonyms:
4-Amino-N-(2-phenyl-2H-pyrazol-3-yl)-benzenesulfonamide CHEMBL1109 Sulfabid US9180183, Sulfaphenazole
Type:
Small organic molecule
Emp. Form.:
C15H14N4O2S
Mol. Mass.:
314.362
SMILES:
Nc1ccc(cc1)S(=O)(=O)Nc1ccnn1-c1ccccc1
:
Substrate
Name:
BDBM13066
Synonyms:
2-{2-[(2,6-dichlorophenyl)amino]phenyl}acetic acid Diclofenac US11478464, Compound Diclofenac {2-[(2,6-dichlorophenyl)amino]phenyl}acetic acid
Type:
Small organic molecule
Emp. Form.:
C14H11Cl2NO2
Mol. Mass.:
296.149
SMILES:
OC(=O)Cc1ccccc1Nc1c(Cl)cccc1Cl
: