Target
Carbonic anhydrase 2
Ligand
BDBM10849
Substrate
Meas. Tech.
Enzyme Inhibition Assay
pH
7.4±0
Temperature
298.15±0 K
IC50
2.000e+6±n/a nM
Citation
 Sethi, KKSahoo, SKPichikala, JNSuresh, P Carbonic anhydrase I and II inhibition with natural products: caffeine and piperine. J Enzyme Inhib Med Chem 27:97-100 (2012)  
Target
Name:
Carbonic anhydrase 2
Synonyms:
CA-II CAC Carbonate dehydratase II Carbonic anhydrase 2 (CA-II) Carbonic anhydrase C Carbonic anhydrase II (CA-II) Carbonic anhydrase II (hCA II) | Carbonic anhydrase isoenzyme II (hCA II)
Type:
Enzyme
Mol. Mass.:
29250.71
Organism:
Homo sapiens (Human)
Description:
P00918
Residue:
260
  
Inhibitor
Name:
BDBM10849
Synonyms:
1,3,7-trimethyl-2,3,6,7-tetrahydro-1H-purine-2,6-dione CHEMBL113 caffeine
Type:
Small organic molecule
Emp. Form.:
C8H10N4O2
Mol. Mass.:
194.1906
SMILES:
Cn1cnc2n(C)c(=O)n(C)c(=O)c12
: