Target
5'-AMP-activated protein kinase catalytic subunit alpha-1
Ligand
BDBM236557
Substrate
Meas. Tech.
Mobility Shift Assay
pH
7.5±n/a
Temperature
301.15±n/a K
IC50
>10000±n/a nM
Comments
extracted
Citation
 Wu, FShu, C PI3K and/or mTOR inhibitor US Patent  US9365572 Publication Date 6/14/2016 
Target
Name:
5'-AMP-activated protein kinase catalytic subunit alpha-1
Synonyms:
AAPK1_HUMAN AMP-activated protein kinase alpha-1/beta-2/gamma-2 AMPK subunit alpha-1 AMPK1 PRKAA1 | Tau-protein kinase PRKAA1
Type:
Protein
Mol. Mass.:
64023.62
Organism:
Homo sapiens (Human)
Description:
Q13131
Residue:
559
  
Inhibitor
Name:
BDBM236557
Synonyms:
US9365572, 5
Type:
Small organic molecule
Emp. Form.:
C22H13F3N6O2
Mol. Mass.:
450.3728
SMILES:
Nc1ccc(cn1)-c1ccc2ncc3c(n(-c4cccc(c4)C(F)(F)F)c(=O)[nH]c3=O)c2n1
: