Target
Carbonic anhydrase 2
Ligand
BDBM50166571
Substrate
Meas. Tech.
Esterase Activity Assay
IC50
341±n/a nM
Citation
 Alp, CÖzsoy, Å¿Alp, NAErdem, DGültekin, MSKüfrevioglu, ÿİSentürk, MSupuran, CT Sulfapyridine-like benzenesulfonamide derivatives as inhibitors of carbonic anhydrase isoenzymes I, II and VI. J Enzyme Inhib Med Chem 27:818-24 (2012)  
Target
Name:
Carbonic anhydrase 2
Synonyms:
CA-II CAC Carbonate dehydratase II Carbonic anhydrase 2 (CA-II) Carbonic anhydrase C Carbonic anhydrase II (CA-II) Carbonic anhydrase II (hCA II) | Carbonic anhydrase isoenzyme II (hCA II)
Type:
Enzyme
Mol. Mass.:
29250.71
Organism:
Homo sapiens (Human)
Description:
P00918
Residue:
260
  
Inhibitor
Name:
BDBM50166571
Synonyms:
2-sulfanilamidopyrimidine 4-Amino-N-(pyridin-2-yl) benzenesulfonamide (Sulfapyridine) (13) 4-amino-N-2-pyrimidinylbenzenesulfonamide N(1)-2-pyrimidinylsulfanilamide SULFADIAZINE sulphadiazine
Type:
Small organic molecule
Emp. Form.:
C10H10N4O2S
Mol. Mass.:
250.277
SMILES:
Nc1ccc(cc1)S(=O)(=O)Nc1ncccn1
: